{"text_format":"1","workbook":"xlsx","n_sheets":19,"sheets":["Data Input guidelines ","Data Preparation","Summary","BudgetGroups","BudgetHeads","BudgetAccounts","Analysis","BudgetAllocations","BankBalances","VAT","FinancialYearDetails","UnreconciledTransactions","YearToDateTransactions","CFRMappings","ReportLinkAnalysis","AnalysisAllocations","AlternativePayees","Contacts","Catalogues"],"not_rendered":{"charts":0,"images":9,"macros":1,"external_links":0,"defined_names":4,"comments":0,"pivot_tables":0},"unopened":[],"bounds":{"document_bytes":16777216,"sheet_cells":100000,"rows_first":2000,"rows_last":500,"rows_between":2000,"halvings":0,"cell_chars":16384,"cell_head_chars":4096},"cells_cut":0,"cells_raw":0,"read":"whole","date_system":"1900"}

{"sheet":"Data Input guidelines ","index":0,"n_rows":26,"n_cols":5,"rows_kept":26,"cut":false,"hidden":false,"merged":[]}
[null,"Instructions"]
[null,1,"Populate each of the tabs on this spreadsheet following the guidlelines below. Pay attention to mandatory fields, max character length, transaction types, negative signage and special characters not allowed."]
[null,2,"One complete workbook is required for each school."]
[null,3,"Please ensure the migration data file name is in this format - ArborFinance.xlsx"]
[null,4,"Please do not amend the name of any of the worksheets – all are required even if they are not populated with data, and it is essential that the file names are accurate."]
[null,5,"Ensure that the data has passed the validation on the Summary tab before sending."]
[null,6,"Please follow the instructions to upload the data using the portal link received in the email."]
[]
[]
[null,"#","Transaction","Data format"]
{"$rows_left_out":17}
{"sheet":"Data Preparation","index":1,"n_rows":104,"n_cols":32,"rows_kept":104,"cut":false,"hidden":false,"merged":[[17,2,17,6],[18,2,18,6],[19,2,19,6]]}
[null,null,null,null,null,null,null,null,null,null,null,null,null,null,null,null,null,null,null,null,null,null,null,null,null,null,"Please Select",null,null,"CFR Code","CFR Description"]
[null,null,null,null,null,null,null,null,null,null,null,null,null,null,null,null,null,null,null,null,null,null,null,null,null,null,"CFR Code",null,null,"I01","I01 Funds delegated by the LA",{"$f":"IF(AD2<>\"\",AD2&\"-\"&AE2,\"\")","v":"I01-I01 Funds delegated by the LA"}]
[null,null,null,null,null,null,null,null,null,null,null,null,null,null,null,null,null,null,null,null,null,null,null,null,null,null,"Ledger Group",null,null,"I02","I02 Funding for sixth form ",{"$f":"IF(AD3<>\"\",AD3&\"-\"&AE3,\"\")","v":"I02-I02 Funding for sixth form "}]
[null,null,null,null,null,null,null,null,null,null,null,null,null,null,null,null,null,null,null,null,null,null,null,null,null,null,"Cost Centre Group",null,null,"I03","I03 High needs top-up funding","I03-I03 High needs top-up funding"]
[null,null,null,null,null,null,null,null,null,null,null,null,null,null,null,null,null,null,null,null,null,null,null,null,null,null,"Please Select",null,null,"I04","I04 Funding for minority ethnic","I04-I04 Funding for minority ethnic"]
[null,null,null,null,null,null,null,null,null,null,null,null,null,null,null,null,null,null,null,null,null,null,null,null,null,null,"Ledger Code",null,null,"I05","I05 Pupil Premium","I05-I05 Pupil Premium"]
[null,null,null,null,null,null,null,null,null,null,null,null,null,null,null,null,null,null,null,null,null,null,null,null,null,null,"Cost Centre",null,null,"I06","I06 Other Government grants","I06-I06 Other Government grants"]
[null,null,null,null,null,null,null,null,null,null,null,null,null,null,null,null,null,null,null,null,null,null,null,null,null,null,"Please Select",null,null,"I07","I07 Other grants","I07-I07 Other grants"]
[null,null,null,null,null,null,null,null,null,null,null,null,null,null,null,null,null,null,null,null,null,null,null,null,null,null,"Cost Centre",null,null,"I08A","I08a Income from letting premises","I08A-I08a Income from letting premises"]
[null,null,null,null,null,null,null,null,null,null,null,null,null,null,null,null,null,null,null,null,null,null,null,null,null,null,"Ledger Code",null,null,"I08B","I08b Other income from facilities ","I08B-I08b Other income from facilities "]
{"$rows_left_out":95}
{"sheet":"Summary","index":2,"n_rows":34,"n_cols":6,"rows_kept":34,"cut":false,"hidden":false,"merged":[]}
["Data Validation Summary"]
[]
[null,"Bank Name","Reconciled Balance ","Unreconciled Inc","Unreconciled ESP","Total"]
["Bank Cashbook Balance",{"$f":"BankBalances!A2","v":0},{"$f":"VLOOKUP(B4,BankBalances!$A$2:$G$48,7,FALSE)","v":{"$error":"#N/A"}},{"$f":"SUMIFS(UnreconciledTransactions!$H:$H,UnreconciledTransactions!$M:$M,B4,UnreconciledTransactions!$A:$A,\"INC\")-SUMIFS(UnreconciledTransactions!$H:$H,UnreconciledTransactions!$M:$M,B4,UnreconciledTransactions!$A:$A,\"I/C\")","v":0},{"$f":"SUMIFS(UnreconciledTransactions!$H:$H,UnreconciledTransactions!$M:$M,B4,UnreconciledTransactions!$A:$A,\"ESP\")-SUMIFS(UnreconciledTransactions!$H:$H,UnreconciledTransactions!$M:$M,B4,UnreconciledTransactions!$A:$A,\"ESC\")","v":0},{"$f":"IFERROR((C4+D4)-E4,\"0\")","v":"0"}]
[null,{"$f":"BankBalances!A3","v":0},{"$f":"VLOOKUP(B5,BankBalances!$A$2:$G$48,7,FALSE)","v":{"$error":"#N/A"}},{"$f":"SUMIFS(UnreconciledTransactions!$H:$H,UnreconciledTransactions!$M:$M,B5,UnreconciledTransactions!$A:$A,\"INC\")-SUMIFS(UnreconciledTransactions!$H:$H,UnreconciledTransactions!$M:$M,B5,UnreconciledTransactions!$A:$A,\"I/C\")","v":0},{"$f":"SUMIFS(UnreconciledTransactions!$H:$H,UnreconciledTransactions!$M:$M,B5,UnreconciledTransactions!$A:$A,\"ESP\")-SUMIFS(UnreconciledTransactions!$H:$H,UnreconciledTransactions!$M:$M,B5,UnreconciledTransactions!$A:$A,\"ESC\")","v":0},{"$f":"IFERROR((C5+D5)-E5,\"0\")","v":"0"}]
[null,{"$f":"BankBalances!A4","v":0},{"$f":"VLOOKUP(B6,BankBalances!$A$2:$G$48,7,FALSE)","v":{"$error":"#N/A"}},{"$f":"SUMIFS(UnreconciledTransactions!$H:$H,UnreconciledTransactions!$M:$M,B6,UnreconciledTransactions!$A:$A,\"INC\")-SUMIFS(UnreconciledTransactions!$H:$H,UnreconciledTransactions!$M:$M,B6,UnreconciledTransactions!$A:$A,\"I/C\")","v":0},{"$f":"SUMIFS(UnreconciledTransactions!$H:$H,UnreconciledTransactions!$M:$M,B6,UnreconciledTransactions!$A:$A,\"ESP\")-SUMIFS(UnreconciledTransactions!$H:$H,UnreconciledTransactions!$M:$M,B6,UnreconciledTransactions!$A:$A,\"ESC\")","v":0},{"$f":"IFERROR((C6+D6)-E6,\"0\")","v":"0"}]
[null,{"$f":"BankBalances!A5","v":0},{"$f":"VLOOKUP(B7,BankBalances!$A$2:$G$48,7,FALSE)","v":{"$error":"#N/A"}},{"$f":"SUMIFS(UnreconciledTransactions!$H:$H,UnreconciledTransactions!$M:$M,B7,UnreconciledTransactions!$A:$A,\"INC\")-SUMIFS(UnreconciledTransactions!$H:$H,UnreconciledTransactions!$M:$M,B7,UnreconciledTransactions!$A:$A,\"I/C\")","v":0},{"$f":"SUMIFS(UnreconciledTransactions!$H:$H,UnreconciledTransactions!$M:$M,B7,UnreconciledTransactions!$A:$A,\"ESP\")-SUMIFS(UnreconciledTransactions!$H:$H,UnreconciledTransactions!$M:$M,B7,UnreconciledTransactions!$A:$A,\"ESC\")","v":0},"0"]
[null,{"$f":"BankBalances!A6","v":0},{"$f":"VLOOKUP(B8,BankBalances!$A$2:$G$48,7,FALSE)","v":{"$error":"#N/A"}},{"$f":"SUMIFS(UnreconciledTransactions!$H:$H,UnreconciledTransactions!$M:$M,B8,UnreconciledTransactions!$A:$A,\"INC\")-SUMIFS(UnreconciledTransactions!$H:$H,UnreconciledTransactions!$M:$M,B8,UnreconciledTransactions!$A:$A,\"I/C\")","v":0},{"$f":"SUMIFS(UnreconciledTransactions!$H:$H,UnreconciledTransactions!$M:$M,B8,UnreconciledTransactions!$A:$A,\"ESP\")-SUMIFS(UnreconciledTransactions!$H:$H,UnreconciledTransactions!$M:$M,B8,UnreconciledTransactions!$A:$A,\"ESC\")","v":0},{"$f":"IFERROR((C8+D8)-E8,\"0\")","v":"0"}]
[null,{"$f":"BankBalances!A7","v":0},{"$f":"VLOOKUP(B9,BankBalances!$A$2:$G$48,7,FALSE)","v":{"$error":"#N/A"}},{"$f":"SUMIFS(UnreconciledTransactions!$H:$H,UnreconciledTransactions!$M:$M,B9,UnreconciledTransactions!$A:$A,\"INC\")-SUMIFS(UnreconciledTransactions!$H:$H,UnreconciledTransactions!$M:$M,B9,UnreconciledTransactions!$A:$A,\"I/C\")","v":0},{"$f":"SUMIFS(UnreconciledTransactions!$H:$H,UnreconciledTransactions!$M:$M,B9,UnreconciledTransactions!$A:$A,\"ESP\")-SUMIFS(UnreconciledTransactions!$H:$H,UnreconciledTransactions!$M:$M,B9,UnreconciledTransactions!$A:$A,\"ESC\")","v":0},"0"]
[null,{"$f":"BankBalances!A8","v":0},{"$f":"VLOOKUP(B10,BankBalances!$A$2:$G$48,7,FALSE)","v":{"$error":"#N/A"}},{"$f":"SUMIFS(UnreconciledTransactions!$H:$H,UnreconciledTransactions!$M:$M,B10,UnreconciledTransactions!$A:$A,\"INC\")-SUMIFS(UnreconciledTransactions!$H:$H,UnreconciledTransactions!$M:$M,B10,UnreconciledTransactions!$A:$A,\"I/C\")","v":0},{"$f":"SUMIFS(UnreconciledTransactions!$H:$H,UnreconciledTransactions!$M:$M,B10,UnreconciledTransactions!$A:$A,\"ESP\")-SUMIFS(UnreconciledTransactions!$H:$H,UnreconciledTransactions!$M:$M,B10,UnreconciledTransactions!$A:$A,\"ESC\")","v":0},"0"]
{"$rows_left_out":25}
{"sheet":"BudgetGroups","index":3,"n_rows":99,"n_cols":27,"rows_kept":99,"cut":false,"hidden":false,"merged":[]}
["Code","Description","Type"]
[null,null,null,null,null,null,null,null,null,null,null,null,null,null,null,null,null,null,null,null,null,null,null,null,null,null,{"$f":"IF(A2<>\"\",A2&\"-\"&B2,\"\")","v":""}]
[null,null,null,null,null,null,null,null,null,null,null,null,null,null,null,null,null,null,null,null,null,null,null,null,null,null,{"$f":"IF(A3<>\"\",A3&\"-\"&B3,\"\")","v":""}]
[null,null,null,null,null,null,null,null,null,null,null,null,null,null,null,null,null,null,null,null,null,null,null,null,null,null,""]
[null,null,null,null,null,null,null,null,null,null,null,null,null,null,null,null,null,null,null,null,null,null,null,null,null,null,""]
[null,null,null,null,null,null,null,null,null,null,null,null,null,null,null,null,null,null,null,null,null,null,null,null,null,null,""]
[null,null,null,null,null,null,null,null,null,null,null,null,null,null,null,null,null,null,null,null,null,null,null,null,null,null,""]
[null,null,null,null,null,null,null,null,null,null,null,null,null,null,null,null,null,null,null,null,null,null,null,null,null,null,""]
[null,null,null,null,null,null,null,null,null,null,null,null,null,null,null,null,null,null,null,null,null,null,null,null,null,null,""]
[null,null,null,null,null,null,null,null,null,null,null,null,null,null,null,null,null,null,null,null,null,null,null,null,null,null,""]
{"$rows_left_out":90}
{"sheet":"BudgetHeads","index":4,"n_rows":300,"n_cols":31,"rows_kept":300,"cut":false,"hidden":false,"merged":[]}
["Code","Description"]
[null,null,null,null,null,null,null,null,null,null,null,null,null,null,null,null,null,null,null,null,null,null,null,null,null,null,null,null,null,null,{"$f":"IF(A2<>\"\",A2 & \"-\" & B2,\"\")","v":""}]
[null,null,null,null,null,null,null,null,null,null,null,null,null,null,null,null,null,null,null,null,null,null,null,null,null,null,null,null,null,null,""]
[null,null,null,null,null,null,null,null,null,null,null,null,null,null,null,null,null,null,null,null,null,null,null,null,null,null,null,null,null,null,""]
[null,null,null,null,null,null,null,null,null,null,null,null,null,null,null,null,null,null,null,null,null,null,null,null,null,null,null,null,null,null,""]
[null,null,null,null,null,null,null,null,null,null,null,null,null,null,null,null,null,null,null,null,null,null,null,null,null,null,null,null,null,null,""]
[null,null,null,null,null,null,null,null,null,null,null,null,null,null,null,null,null,null,null,null,null,null,null,null,null,null,null,null,null,null,""]
[null,null,null,null,null,null,null,null,null,null,null,null,null,null,null,null,null,null,null,null,null,null,null,null,null,null,null,null,null,null,""]
[null,null,null,null,null,null,null,null,null,null,null,null,null,null,null,null,null,null,null,null,null,null,null,null,null,null,null,null,null,null,""]
[null,null,null,null,null,null,null,null,null,null,null,null,null,null,null,null,null,null,null,null,null,null,null,null,null,null,null,null,null,null,""]
{"$rows_left_out":291}
{"sheet":"BudgetAccounts","index":5,"n_rows":4,"n_cols":8,"rows_kept":4,"cut":false,"hidden":false,"merged":[[3,4,18,5]]}
["New Code","New Description","BudgetHeadCode","BudgetGroupCode",null,null,"Current Code","Current Description"]
[]
[]
[null,null,null,null,"Budget codes are restricted to a maximum length of 8 characters. Codes exceeding this limit have been adjusted, with changes highlighted for your review. Please review these updates, make any necessary corrections, and also address any duplicate codes by updating as new codes.\nFor any changes to the Budget Account Code or Description, please click the 'Validate Data' button to ensure the updates are reflected across the other tabs. Please avoid making any modifications to the values in Columns G and H."]

{"sheet":"Analysis","index":6,"n_rows":4,"n_cols":9,"rows_kept":4,"cut":false,"hidden":false,"merged":[[3,5,15,6]]}
["New Analysis code","Type (Inc/Exp)","New Description","Sort Key","Report Link",null,null,"Current Analysis code","Current Description"]
[]
[]
[null,null,null,null,null,"Analysis code length is restricted to 12 characters. Codes exceeding this limit have been updated, with changes highlighted for your review. Please review these adjustments and make any necessary updates. For any changes to the Analysis Account Code or Description, please click the 'Validate Data' button to ensure the updates are reflected across the other tabs. Please avoid making any modifications to the values in Columns H and I."]

{"sheet":"BudgetAllocations","index":7,"n_rows":409,"n_cols":20,"rows_kept":409,"cut":false,"hidden":false,"merged":[]}
["Type (Inc/Exp)","Account","Description","Amount","Ref","Voucher description","Budget heading","Date","Analysis Code","Analysis Description"]
[null,null,null,null,null,null,null,null,null,null,null,null,null,null,null,null,null,null,"ES",{"$f":"IFERROR(INDEX(BudgetAccounts!A:D, MATCH(B2,BudgetAccounts!A:A, 0),3),0)","v":0}]
[null,null,null,null,null,null,null,null,null,null,null,null,null,null,null,null,null,null,"ES",{"$f":"IFERROR(INDEX(BudgetAccounts!A:D, MATCH(B3,BudgetAccounts!A:A, 0),3),0)","v":0}]
[null,null,null,null,null,null,null,null,null,null,null,null,null,null,null,null,null,null,"ES",{"$f":"IFERROR(INDEX(BudgetAccounts!A:D, MATCH(B4,BudgetAccounts!A:A, 0),3),0)","v":0}]
[null,null,null,null,null,null,null,null,null,null,null,null,null,null,null,null,null,null,"ES",{"$f":"IFERROR(INDEX(BudgetAccounts!A:D, MATCH(B5,BudgetAccounts!A:A, 0),3),0)","v":0}]
[null,null,null,null,null,null,null,null,null,null,null,null,null,null,null,null,null,null,"ES",{"$f":"IFERROR(INDEX(BudgetAccounts!A:D, MATCH(B6,BudgetAccounts!A:A, 0),3),0)","v":0}]
[null,null,null,null,null,null,null,null,null,null,null,null,null,null,null,null,null,null,"ES",{"$f":"IFERROR(INDEX(BudgetAccounts!A:D, MATCH(B7,BudgetAccounts!A:A, 0),3),0)","v":0}]
[null,null,null,null,null,null,null,null,null,null,null,null,null,null,null,null,null,null,"ES",{"$f":"IFERROR(INDEX(BudgetAccounts!A:D, MATCH(B8,BudgetAccounts!A:A, 0),3),0)","v":0}]
[null,null,null,null,null,null,null,null,null,null,null,null,null,null,null,null,null,null,"EX",{"$f":"IFERROR(INDEX(BudgetAccounts!A:D, MATCH(B9,BudgetAccounts!A:A, 0),3),0)","v":0}]
[null,null,null,null,null,null,null,null,null,null,null,null,null,null,null,null,null,null,"EX",{"$f":"IFERROR(INDEX(BudgetAccounts!A:D, MATCH(B10,BudgetAccounts!A:A, 0),3),0)","v":0}]
{"$rows_left_out":400}
{"sheet":"BankBalances","index":8,"n_rows":20,"n_cols":23,"rows_kept":20,"cut":false,"hidden":false,"merged":[]}
["Account Name","Account No. ","Sort Code.","Default Bank (Y/N)","BACS (Y/N)","BACS File Format","Reconciled Balance","Reconciled Date",null,null,null,null,null,null,"Unreconciled Expenditure","Unreconciled Income","Cashbook Balance"]
[null,null,null,null,null,null,null,null,null,null,null,null,null,null,null,null,null,null,null,null,"Barclays",null,"Y"]
[null,null,null,null,null,null,null,null,null,null,null,null,null,null,{"$f":"IF(A3<>\"\",SUMIFS(UnreconciledTransactions!H:H,UnreconciledTransactions!A:A,\"ESP\",UnreconciledTransactions!M:M,BankBalances!A3),\"\")","v":""},{"$f":"IF(A3<>\"\",SUMIFS(UnreconciledTransactions!H:H,UnreconciledTransactions!A:A,\"INC\",UnreconciledTransactions!M:M,BankBalances!A3),\"\")","v":""},804214.12,null,null,null,"Cooperative Bank",null,"N"]
[null,null,null,null,null,null,null,null,null,null,null,null,null,null,{"$f":"IF(A4<>\"\",SUMIFS(UnreconciledTransactions!H:H,UnreconciledTransactions!A:A,\"ESP\",UnreconciledTransactions!M:M,BankBalances!A4),\"\")","v":""},{"$f":"IF(A4<>\"\",SUMIFS(UnreconciledTransactions!H:H,UnreconciledTransactions!A:A,\"INC\",UnreconciledTransactions!M:M,BankBalances!A4),\"\")","v":""},3012,null,null,null,"HSBC"]
[null,null,null,null,null,null,null,null,null,null,null,null,null,null,{"$f":"IF(A5<>\"\",SUMIFS(UnreconciledTransactions!H:H,UnreconciledTransactions!A:A,\"ESP\",UnreconciledTransactions!M:M,BankBalances!A5),\"\")","v":""},{"$f":"IF(A5<>\"\",SUMIFS(UnreconciledTransactions!H:H,UnreconciledTransactions!A:A,\"INC\",UnreconciledTransactions!M:M,BankBalances!A5),\"\")","v":""},-1093577.79,null,null,null,"HSBC Standard 18 DAILY"]
[null,null,null,null,null,null,null,null,null,null,null,null,null,null,{"$f":"IF(A6<>\"\",SUMIFS(UnreconciledTransactions!H:H,UnreconciledTransactions!A:A,\"ESP\",UnreconciledTransactions!M:M,BankBalances!A6),\"\")","v":""},{"$f":"IF(A6<>\"\",SUMIFS(UnreconciledTransactions!H:H,UnreconciledTransactions!A:A,\"INC\",UnreconciledTransactions!M:M,BankBalances!A6),\"\")","v":""},-35736.949999999997,null,null,null,"Lloyds - multiple standard CSV"]
[null,null,null,null,null,null,null,null,null,null,null,null,null,null,{"$f":"IF(A7<>\"\",SUMIFS(UnreconciledTransactions!H:H,UnreconciledTransactions!A:A,\"ESP\",UnreconciledTransactions!M:M,BankBalances!A7),\"\")","v":""},{"$f":"IF(A7<>\"\",SUMIFS(UnreconciledTransactions!H:H,UnreconciledTransactions!A:A,\"INC\",UnreconciledTransactions!M:M,BankBalances!A7),\"\")","v":""},-5750,null,null,null,"Lloyds Cooperative Online"]
[null,null,null,null,null,null,null,null,null,null,null,null,null,null,{"$f":"IF(A8<>\"\",SUMIFS(UnreconciledTransactions!H:H,UnreconciledTransactions!A:A,\"ESP\",UnreconciledTransactions!M:M,BankBalances!A8),\"\")","v":""},{"$f":"IF(A8<>\"\",SUMIFS(UnreconciledTransactions!H:H,UnreconciledTransactions!A:A,\"INC\",UnreconciledTransactions!M:M,BankBalances!A8),\"\")","v":""},null,null,null,null,"Natwest"]
[null,null,null,null,null,null,null,null,null,null,null,null,null,null,{"$f":"IF(A9<>\"\",SUMIFS(UnreconciledTransactions!H:H,UnreconciledTransactions!A:A,\"ESP\",UnreconciledTransactions!M:M,BankBalances!A9),\"\")","v":""},{"$f":"IF(A9<>\"\",SUMIFS(UnreconciledTransactions!H:H,UnreconciledTransactions!A:A,\"INC\",UnreconciledTransactions!M:M,BankBalances!A9),\"\")","v":""},null,null,null,null,"Natwest Bulk Payment"]
[null,null,null,null,null,null,null,null,null,null,null,null,null,null,{"$f":"IF(A10<>\"\",SUMIFS(UnreconciledTransactions!H:H,UnreconciledTransactions!A:A,\"ESP\",UnreconciledTransactions!M:M,BankBalances!A10),\"\")","v":""},{"$f":"IF(A10<>\"\",SUMIFS(UnreconciledTransactions!H:H,UnreconciledTransactions!A:A,\"INC\",UnreconciledTransactions!M:M,BankBalances!A10),\"\")","v":""},null,null,null,null,"Natwest Standard domestic payment"]
{"$rows_left_out":11}
{"sheet":"VAT","index":9,"n_rows":6,"n_cols":9,"rows_kept":6,"cut":false,"hidden":false,"merged":[[4,8,9,11]]}
["Rate","Output Code","Output Code Description","Output YTD VAT (VAT creditor)","Input Code","Input Code Description","Input YTD (VAT Debtor)"]
["20%","T","20% Rated VAT Income",{"$f":"IF(INDEX(#REF!,MATCH(\"Output VAT\",#REF!,0),5)<0,INDEX(#REF!,MATCH(\"Output VAT\",#REF!,0),5)*-1,INDEX(#REF!,MATCH(\"Output VAT\",#REF!,0),5))","v":{"$error":"#REF!"}},5,"20% Rated VAT ",{"$f":"INDEX(#REF!,MATCH(\"Input VAT\",#REF!,0),5)","v":{"$error":"#REF!"}}]
["0%","Z","Zero Rated VAT Income",null,1,"Zero Rated VAT "]
["5%","R","Reduced Rate VAT Income",null,6,"Reduced Rate VAT "]
["0%","O","Outside Scope",null,8,"Outside Scope",null,null,"Note: You may edit the Codes, rates, and descriptions. However, please refrain from modifying the fields highlighted in Green, as they are essential for calculations in other tabs of the workbook"]
["0%","E","Exempt",null,9,"Exempt"]

{"sheet":"FinancialYearDetails","index":10,"n_rows":1,"n_cols":3,"rows_kept":1,"cut":false,"hidden":false,"merged":[]}
["FY Start Date(dd/mm/yyyy)","FY End Date(dd/mm/yyyy)","Current Period(1-12)"]

{"sheet":"UnreconciledTransactions","index":11,"n_rows":1,"n_cols":19,"rows_kept":1,"cut":false,"hidden":false,"merged":[]}
["Type","Transaction date","Contact","Alternate payee","Analysis code","Budget code","Payment type","Gross","Nett","Vat","Reference","Batch reference","Bank account","Details","Vat code","Invoice no","S16","Funding stream","Cost centre"]

{"sheet":"YearToDateTransactions","index":12,"n_rows":1,"n_cols":19,"rows_kept":1,"cut":false,"hidden":false,"merged":[]}
["Type","Transaction date","Contact","Alternate payee","Analysis code","Budget code","Payment type","Gross","Nett","Vat","Reference","Batch reference","Bank account","Details","Vat code","Invoice no","S16","Funding stream","Cost centre"]

{"sheet":"CFRMappings","index":13,"n_rows":1,"n_cols":3,"rows_kept":1,"cut":false,"hidden":false,"merged":[]}
["CFR Code","Budget Code","Budget Description"]

{"sheet":"ReportLinkAnalysis","index":14,"n_rows":1,"n_cols":3,"rows_kept":1,"cut":false,"hidden":true,"merged":[]}
["Code","Description","SecondKey"]

{"sheet":"AnalysisAllocations","index":15,"n_rows":1,"n_cols":13,"rows_kept":1,"cut":false,"hidden":true,"merged":[]}
["Analysis code","Month1","Month2","Month3","Month4","Month5","Month6","Month7","Month8","Month9","Month10","Month11","Month12"]

{"sheet":"AlternativePayees","index":16,"n_rows":1,"n_cols":24,"rows_kept":1,"cut":false,"hidden":true,"merged":[]}
["Payee Code","Full Name","Sort Key","Contact","Address1","Address2","Address3","Address4","Address5","PostCode","Phone","Fax","Vat No","Reference","Email","Bacs payment","Cheque payment","Direct Debit","Remittance Method","Remittance Email","BacsBankName","BacsSortCode","BacsAccountNo","BacsReference"]

{"sheet":"Contacts","index":17,"n_rows":1,"n_cols":35,"rows_kept":1,"cut":false,"hidden":true,"merged":[]}
["Account Code","Name","Sort key","Income Source","Supplier","Customer","Contact","Address 1","Address 2","Address 3","Address 4","Address 5","Postcode","Phone1","Phone2","Fax","VatNumber","S16","Reference","Email","IsCheque","IsBacs","IsDirectDebit","Remittance email","Remittance method","Alternative Payee","Company Type","Note","Bacs Bank name","BacsSortCode","BacsAccountNo","Bacs reference","Contact position","Company registration","Supplier terms"]

{"sheet":"Catalogues","index":18,"n_rows":1,"n_cols":4,"rows_kept":1,"cut":false,"hidden":true,"merged":[]}
["Catalogue Code","Description","Price","Unit of Measure"]